Reaction Details
TargetCarbonic anhydrase 1
LigandBDBM12414
Substrate/CompetitorBDBM11402
Meas. Tech.Competitive Displacement Binding Assay
pH7±n/a
Temperature298.15±n/a K
Kd 4030±n/a nM
Citation Jude, KMBanerjee, ALHaldar, MKManokaran, SRoy, BMallik, SSrivastava, DKChristianson, DW Ultrahigh resolution crystal structures of human carbonic anhydrases I and II complexed with "two-prong" inhibitors reveal the molecular basis of high affinity. J Am Chem Soc128:3011-8 (2006) 
 
Carbonic anhydrase 1
Name:Carbonic anhydrase 1
Type:Enzyme
Mol. Mass.:28873.37
Organism:Homo sapiens (Human)
Description:P00915
Residue:261
BDBM12414
BDBM11402
NameBDBM12414
Synonyms:CHEMBL27601 hCA inhibitor, 6
TypeSmall organic molecule
Emp. Form.C6H7NO2S
Mol. Mass.157.19
SMILESNS(=O)(=O)c1ccccc1