Reaction Details
TargetCarbonic anhydrase 1
LigandBDBM12415
Substrate/CompetitorBDBM11402
Meas. Tech.Competitive Displacement Binding Assay
pH7±n/a
Temperature298.15±n/a K
Kd 200±n/a nM
Citation Jude, KMBanerjee, ALHaldar, MKManokaran, SRoy, BMallik, SSrivastava, DKChristianson, DW Ultrahigh resolution crystal structures of human carbonic anhydrases I and II complexed with "two-prong" inhibitors reveal the molecular basis of high affinity. J Am Chem Soc128:3011-8 (2006) 
 
Carbonic anhydrase 1
Name:Carbonic anhydrase 1
Type:Enzyme
Mol. Mass.:28873.37
Organism:Homo sapiens (Human)
Description:P00915
Residue:261
BDBM12415
BDBM11402
NameBDBM12415
Synonyms:BR15 | copper(2+) ion 2-[(carboxylatomethyl)[(4-{[2-(4-sulfamoylphenyl)ethyl]carbamoyl}phenyl)methyl]amino]acetate
TypeSmall organic molecule
Emp. Form.C20H21N3O7S
Mol. Mass.447.463
SMILESNS(=O)(=O)c1ccc(CCNC(=O)c2ccc(CN(CC([O-])=O)CC([O-])=O)cc2)cc1