Reaction Details
TargetCarbonic anhydrase 1
LigandBDBM12418
Substrate/CompetitorBDBM11402
Meas. Tech.Competitive Displacement Binding Assay
pH7±n/a
Temperature298.15±n/a K
Kd 120±n/a nM
Citation Jude, KMBanerjee, ALHaldar, MKManokaran, SRoy, BMallik, SSrivastava, DKChristianson, DW Ultrahigh resolution crystal structures of human carbonic anhydrases I and II complexed with "two-prong" inhibitors reveal the molecular basis of high affinity. J Am Chem Soc128:3011-8 (2006) 
 
Carbonic anhydrase 1
Name:Carbonic anhydrase 1
Type:Enzyme
Mol. Mass.:28873.37
Organism:Homo sapiens (Human)
Description:P00915
Residue:261
BDBM12418
BDBM11402
NameBDBM12418
Synonyms:BR30 | copper(2+) ion 2-[(carboxylatomethyl)({2-[(4-sulfamoylphenyl)formamido]ethyl})amino]acetate
TypeSmall organic molecule
Emp. Form.C13H15N3O7S
Mol. Mass.357.34
SMILESNS(=O)(=O)c1ccc(cc1)C(=O)NCCN(CC([O-])=O)CC([O-])=O