Reaction Details
TargetSortilin
LigandBDBM159138
Substrate/Competitorn/a
Meas. Tech.hSortilin Affinity Assay
Ki 343±n/a nM
Citation Maltas, PJWatson, SLanggård, MDavid, L N-substituted-5-substituted phthalamic acids as sortilin inhibitors US Patent US10195186 Publication Date 2/5/2019
 
Sortilin
Name:Sortilin
Type:PROTEIN
Mol. Mass.:92054.53
Organism:Homo sapiens (Human)
Description:ChEMBL_1282402
Residue:831
BDBM159138
NameBDBM159138
Synonyms:US10195186, Example 16 | US9682967, 16
TypeSmall organic molecule
Emp. Form.C15H7ClF6N2O3
Mol. Mass.412.671
SMILESOC(=O)c1cc(ccc1C(=O)Nc1ncc(cc1Cl)C(F)(F)F)C(F)(F)F