Reaction Details
TargetSortilin
LigandBDBM50445044
Substrate/Competitorn/a
Meas. Tech.hSortilin Affinity Assay
Ki 714±n/a nM
Citation Maltas, PJWatson, SLanggård, MDavid, L N-substituted-5-substituted phthalamic acids as sortilin inhibitors US Patent US10195186 Publication Date 2/5/2019
 
Sortilin
Name:Sortilin
Type:PROTEIN
Mol. Mass.:92054.53
Organism:Homo sapiens (Human)
Description:ChEMBL_1282402
Residue:831
BDBM50445044
NameBDBM50445044
Synonyms:CHEMBL3098765 US9682967, 34
TypeSmall organic molecule
Emp. Form.C13H10BrN3O3
Mol. Mass.336.141
SMILESCc1nccc(NC(=O)c2ccc(Br)cc2C(O)=O)n1