Reaction Details
TargetSortilin
LigandBDBM159273
Substrate/Competitorn/a
Meas. Tech.hSortilin Affinity Assay
Ki 614±n/a nM
Citation Maltas, PJWatson, SLanggård, MDavid, L N-substituted-5-substituted phthalamic acids as sortilin inhibitors US Patent US10195186 Publication Date 2/5/2019
 
Sortilin
Name:Sortilin
Type:PROTEIN
Mol. Mass.:92054.53
Organism:Homo sapiens (Human)
Description:ChEMBL_1282402
Residue:831
BDBM159273
NameBDBM159273
Synonyms:US10195186, Example 51 | US9682967, 49
TypeSmall organic molecule
Emp. Form.C17H12F6N2O3
Mol. Mass.406.2792
SMILESCc1ccc(NC(=O)c2cc(c(cc2C(O)=O)C(F)(F)F)C(F)(F)F)nc1C