Reaction Details
TargetHypoxia-inducible factor 1-alpha
LigandBDBM332031
Substrate/Competitorn/a
Meas. Tech.Stabilization of HIF-1alpha
EC50 780±140 nM
Citation Li, SXiao, JWang, LLong, LLi, WLuo, HLi, FZhong, WZheng, ZXie, YLi, XZhou, XWang, XCao, R Substituted acethydrazide derivative, preparation method and use thereof US Patent US10196346 Publication Date 2/5/2019
 
Hypoxia-inducible factor 1-alpha
Name:Hypoxia-inducible factor 1-alpha
Type:Protein
Mol. Mass.:92647.24
Organism:Homo sapiens (Human)
Description:Q16665
Residue:826
BDBM332031
NameBDBM332031
Synonyms:(E)-N'-(4-N,N- diethylamino-2- hydroxybenzal)-2-{N-{2- [N-(naphthalen-1-yl- methylene)-N- methylamino]ethyl}N- methylamino}acethydrazide | US10196346, Example 5
TypeSmall organic molecule
Emp. Form.C28H37N5O2
Mol. Mass.475.6257
SMILESCCN(CC)c1ccc(\C=N\NC(=O)CN(C)CCN(C)Cc2cccc3ccccc23)c(O)c1