Reaction Details
TargetHypoxia-inducible factor 1-alpha
LigandBDBM332038
Substrate/Competitorn/a
Meas. Tech.Stabilization of HIF-1alpha
EC50 560±150 nM
Citation Li, SXiao, JWang, LLong, LLi, WLuo, HLi, FZhong, WZheng, ZXie, YLi, XZhou, XWang, XCao, R Substituted acethydrazide derivative, preparation method and use thereof US Patent US10196346 Publication Date 2/5/2019
 
Hypoxia-inducible factor 1-alpha
Name:Hypoxia-inducible factor 1-alpha
Type:Protein
Mol. Mass.:92647.24
Organism:Homo sapiens (Human)
Description:Q16665
Residue:826
BDBM332038
NameBDBM332038
Synonyms:(E)-N'-(2,3- dihydroxybenzal)-2-{N-{2- [N-(4-isopropylbenzyl)-N- methylamino]ethyl}N- methylamino}acethydrazide | US10196346, Example 17
TypeSmall organic molecule
Emp. Form.C23H32N4O3
Mol. Mass.412.5252
SMILESCC(C)c1ccc(CN(C)CCN(C)CC(=O)N\N=C\c2cccc(O)c2O)cc1