Reaction Details
TargetHypoxia-inducible factor 1-alpha
LigandBDBM332047
Substrate/Competitorn/a
Meas. Tech.Stabilization of HIF-1alpha
EC50 2770±390 nM
Citation Li, SXiao, JWang, LLong, LLi, WLuo, HLi, FZhong, WZheng, ZXie, YLi, XZhou, XWang, XCao, R Substituted acethydrazide derivative, preparation method and use thereof US Patent US10196346 Publication Date 2/5/2019
 
Hypoxia-inducible factor 1-alpha
Name:Hypoxia-inducible factor 1-alpha
Type:Protein
Mol. Mass.:92647.24
Organism:Homo sapiens (Human)
Description:Q16665
Residue:826
BDBM332047
NameBDBM332047
Synonyms:(E)-N'-(3-ethoxy-2- hydroxybenzal)-2-{N-{2- [N-(4-cyanobenzyl)-N- methylamino]ethyl}N- methylamino}acethydrazide | US10196346, Example 29
TypeSmall organic molecule
Emp. Form.C23H29N5O3
Mol. Mass.423.5081
SMILESCCOc1cccc(\C=N\NC(=O)CN(C)CCN(C)Cc2ccc(cc2)C#N)c1O