Reaction Details
TargetHypoxia-inducible factor 1-alpha
LigandBDBM50042874
Substrate/Competitorn/a
Meas. Tech.Stabilization of HIF-1alpha
EC50 41350±1600 nM
Citation Li, SXiao, JWang, LLong, LLi, WLuo, HLi, FZhong, WZheng, ZXie, YLi, XZhou, XWang, XCao, R Substituted acethydrazide derivative, preparation method and use thereof US Patent US10196346 Publication Date 2/5/2019
 
Hypoxia-inducible factor 1-alpha
Name:Hypoxia-inducible factor 1-alpha
Type:Protein
Mol. Mass.:92647.24
Organism:Homo sapiens (Human)
Description:Q16665
Residue:826
BDBM50042874
NameBDBM50042874
Synonyms:2,2'-Bipyridin 2,2'-bipyridyl 2,2'-dipyridyl CHEMBL39879 alpha,alpha'-bipyridine alpha,alpha'-dipyridine bpy
TypeSmall organic molecule
Emp. Form.C10H8N2
Mol. Mass.156.1839
SMILESc1ccc(nc1)-c1ccccn1