Reaction Details
TargetCoagulation factor X
LigandBDBM12518
Substrate/CompetitorBDBM12500
Meas. Tech.Factor Xa Inhibition Assay
Ki 13±n/a nM
Citation Young, RJCampbell, MBorthwick, ADBrown, DBurns-Kurtis, CLChan, CConvery, MACrowe, MCDayal, SDiallo, HKelly, HAKing, NPKleanthous, SMason, AMMordaunt, JEPatel, CPateman, AJSenger, SShah, GPSmith, PWWatson, NSWeston, HEZhou, P Structure- and property-based design of factor Xa inhibitors: pyrrolidin-2-ones with acyclic alanyl amides as P4 motifs. Bioorg Med Chem Lett16:5953-7 (2006) 
 
Coagulation factor X
Name:Coagulation factor X
Type:Enzyme
Mol. Mass.:54726.60
Organism:Homo sapiens (Human)
Description:n/a
Residue:488
BDBM12518
BDBM12500
NameBDBM12518
Synonyms:(2S)-2-[(3S)-3-[(6-chloronaphthalene-2-)sulfonamido]-2-oxopyrrolidin-1-yl]-N-(propan-2-yl)-N-[2-(pyridin-2-yl)ethyl]propanamide | P4 alanylamide pyrrolidin-2-one 29
TypeSmall organic molecule
Emp. Form.C27H31ClN4O4S
Mol. Mass.543.077
SMILESCC(C)N(CCc1ccccn1)C(=O)[C@H](C)N1CC[C@H](NS(=O)(=O)c2ccc3cc(Cl)ccc3c2)C1=O