Reaction Details
TargetCoagulation factor X
LigandBDBM12538
Substrate/CompetitorBDBM12500
Meas. Tech.Factor Xa Inhibition Assay
Ki 6±n/a nM
Citation Young, RJCampbell, MBorthwick, ADBrown, DBurns-Kurtis, CLChan, CConvery, MACrowe, MCDayal, SDiallo, HKelly, HAKing, NPKleanthous, SMason, AMMordaunt, JEPatel, CPateman, AJSenger, SShah, GPSmith, PWWatson, NSWeston, HEZhou, P Structure- and property-based design of factor Xa inhibitors: pyrrolidin-2-ones with acyclic alanyl amides as P4 motifs. Bioorg Med Chem Lett16:5953-7 (2006) 
 
Coagulation factor X
Name:Coagulation factor X
Type:Enzyme
Mol. Mass.:54726.60
Organism:Homo sapiens (Human)
Description:n/a
Residue:488
BDBM12538
BDBM12500
NameBDBM12538
Synonyms:6-chloro-N-[(3S)-1-[(2S)-1-(morpholin-4-yl)-1-oxopropan-2-yl]-2-oxopyrrolidin-3-yl]naphthalene-2-sulfonamide aminopyrrolidin-2-one 1 | pyrrolidin-2-one-based inhibitor 24
TypeSmall organic molecule
Emp. Form.C21H24ClN3O5S
Mol. Mass.465.95
SMILESC[C@H](N1CC[C@H](NS(=O)(=O)c2ccc3cc(Cl)ccc3c2)C1=O)C(=O)N1CCOCC1