Reaction Details
TargetCoagulation factor X
LigandBDBM12769
Substrate/CompetitorBDBM12658
Meas. Tech.Enzyme Assay and Determination of the Inhibition Constants.
pH7±n/a
Temperature295.15±n/a K
Ki 0.19±n/a nM
Citation Smallheer, JMAlexander, RSWang, JWang, SNakajima, SRossi, KASmallwood, ABarbera, FBurdick, DLuettgen, JMKnabb, RMWexler, RRJadhav, PK SAR and factor IXa crystal structure of a dual inhibitor of factors IXa and Xa. Bioorg Med Chem Lett14:5263-7 (2004) 
 
Coagulation factor X
Name:Coagulation factor X
Type:Enzyme
Mol. Mass.:54726.60
Organism:Homo sapiens (Human)
Description:n/a
Residue:488
BDBM12769
BDBM12658
NameBDBM12769
Synonyms:N-[4-(1H-1,3-benzodiazol-1-yl)phenyl]-1-(3-carbamimidoylphenyl)-3-(3-methyl-1H-1,2,4-triazol-1-yl)-1H-pyrazole-5-carboxamide | pyrazole analog 8b
TypeSmall organic molecule
Emp. Form.C27H22N10O
Mol. Mass.502.53
SMILESCc1ncn(n1)-c1cc(C(=O)Nc2ccc(cc2)-n2cnc3ccccc23)n(n1)-c1cccc(c1)C(N)=N