Reaction Details
TargetCoagulation factor IX
LigandBDBM12757
Substrate/CompetitorBDBM12774
Meas. Tech.Enzyme Assay and Determination of the Inhibition Constants.
Ki 13±n/a nM
Citation Smallheer, JMAlexander, RSWang, JWang, SNakajima, SRossi, KASmallwood, ABarbera, FBurdick, DLuettgen, JMKnabb, RMWexler, RRJadhav, PK SAR and factor IXa crystal structure of a dual inhibitor of factors IXa and Xa. Bioorg Med Chem Lett14:5263-7 (2004) 
 
Coagulation factor IX
Name:Coagulation factor IX
Type:Enzyme
Mol. Mass.:51768.83
Organism:Homo sapiens (Human)
Description:P00740
Residue:461
BDBM12757
BDBM12774
NameBDBM12757
Synonyms:1-(3-carbamimidoylphenyl)-N-(2-fluoro-4-{3H-imidazo[4,5-b]pyridin-3-yl}phenyl)-3-(trifluoromethyl)-1H-pyrazole-5-carboxamide | pyrazole analog 3f
TypeSmall organic molecule
Emp. Form.C24H16F4N8O
Mol. Mass.508.4305
SMILESNC(=N)c1cccc(c1)-n1nc(cc1C(=O)Nc1ccc(cc1F)-n1cnc2cccnc12)C(F)(F)F