Reaction Details
TargetCoagulation factor IX
LigandBDBM12767
Substrate/CompetitorBDBM12774
Meas. Tech.Enzyme Assay and Determination of the Inhibition Constants.
Ki 72±n/a nM
Citation Smallheer, JMAlexander, RSWang, JWang, SNakajima, SRossi, KASmallwood, ABarbera, FBurdick, DLuettgen, JMKnabb, RMWexler, RRJadhav, PK SAR and factor IXa crystal structure of a dual inhibitor of factors IXa and Xa. Bioorg Med Chem Lett14:5263-7 (2004) 
 
Coagulation factor IX
Name:Coagulation factor IX
Type:Enzyme
Mol. Mass.:51768.83
Organism:Homo sapiens (Human)
Description:P00740
Residue:461
BDBM12767
BDBM12774
NameBDBM12767
Synonyms:1-(3-carbamimidoylphenyl)-N-[4-(1H-imidazol-1-yl)phenyl]-3-(trifluoromethyl)-1H-pyrazole-5-carboxamide | pyrazole analog 3p
TypeSmall organic molecule
Emp. Form.C21H16F3N7O
Mol. Mass.439.3932
SMILESNC(=N)c1cccc(c1)-n1nc(cc1C(=O)Nc1ccc(cc1)-n1ccnc1)C(F)(F)F