Reaction Details
TargetMitogen-activated protein kinase 12
LigandBDBM334318
Substrate/Competitorn/a
Meas. Tech.Enzyme Inhibition Assay
IC50 81.0±n/a nM
Citation Frickel, FFyfe, MCMeghani, PThom, SM Kinase inhibitors US Patent US9732063 Publication Date 8/15/2017
 
Mitogen-activated protein kinase 12
Name:Mitogen-activated protein kinase 12
Type:Protein
Mol. Mass.:41938.69
Organism:Homo sapiens (Human)
Description:P53778
Residue:367
BDBM334318
NameBDBM334318
Synonyms:S,S-Dimethyl-N-(4-((4-((4-(3-(3-(tert-butyl)-1-(6-methoxypyridin-3-yl)-1H-pyrazol-5-yl)-ureido)naphthalen-1-yl)oxy)pyrimidin-2-yl)amino)phenyl sulfoximine | US9732063, Example 2
TypeSmall organic molecule
Emp. Form.C36H37N9O4S
Mol. Mass.691.802
SMILESCOc1ccc(cn1)-n1nc(cc1NC(=O)Nc1ccc(Oc2ccnc(Nc3cccc(c3)N=S(C)(C)=O)n2)c2ccccc12)C(C)(C)C