Reaction Details
TargetTyrosine-protein kinase SYK
LigandBDBM334345
Substrate/Competitorn/a
Meas. Tech.Enzyme Inhibition Assay
IC50 16.0±n/a nM
Citation Frickel, FFyfe, MCMeghani, PThom, SM Kinase inhibitors US Patent US9732063 Publication Date 8/15/2017
 
Tyrosine-protein kinase SYK
Name:Tyrosine-protein kinase SYK
Type:Enzyme
Mol. Mass.:72079.99
Organism:Homo sapiens (Human)
Description:P43405
Residue:635
BDBM334345
NameBDBM334345
Synonyms:1-(4-((2-((3-(2,5,8,11-Tetraoxatridecan-13-yloxy)-5-methoxyphenyl)amino)pyrimidin-4-yl)oxy)naphthalen-1-yl)-3-(3-isopropyl-1-(p-tolyl)-1H-pyrazol-5-yl)urea | US9732063, Example 29
TypeSmall organic molecule
Emp. Form.C44H51N7O8
Mol. Mass.805.9178
c1cc(Nc2nccc(Oc3ccc(NC(=O)Nc4cc(nn4-c4ccc(C)cc4)C(C)C)c4ccccc34)n2)cc(OC)c1