Reaction Details
TargetTyrosine-protein kinase SYK
LigandBDBM334379
Substrate/Competitorn/a
Meas. Tech.Enzyme Inhibition Assay
IC50 16.0±n/a nM
Citation Frickel, FFyfe, MCMeghani, PThom, SM Kinase inhibitors US Patent US9732063 Publication Date 8/15/2017
 
Tyrosine-protein kinase SYK
Name:Tyrosine-protein kinase SYK
Type:Enzyme
Mol. Mass.:72079.99
Organism:Homo sapiens (Human)
Description:P43405
Residue:635
BDBM334379
NameBDBM334379
Synonyms:1-(3-(tert-Butyl)-1-(4-(dimethylamino)phenyl)-1H-pyrazol-5-yl)-3-(4-((2-((3-methoxy-5-(2-(2-(2-methoxyethoxy)ethoxy)ethoxy)phenyl)amino)pyrimidin-4-yl)oxy)naphthalen-1-yl)urea | US9732063, Example 63
TypeSmall organic molecule
Emp. Form.C44H52N8O7
Mol. Mass.804.9331
SMILESCOCCOCCOCCOc1cc(Nc2nccc(Oc3ccc(NC(=O)Nc4cc(nn4-c4ccc(cc4)N(C)C)C(C)(C)C)c4ccccc34)n2)cc(OC)c1