Reaction Details
TargetCoagulation factor X
LigandBDBM13008
Substrate/CompetitorBDBM12989
Meas. Tech.Enzyme Inhibition Assay
IC50 8.5±n/a nM
Citation Roehrig, SStraub, APohlmann, JLampe, TPernerstorfer, JSchlemmer, KHReinemer, PPerzborn, E Discovery of the novel antithrombotic agent 5-chloro-N-({(5S)-2-oxo-3-[4-(3-oxomorpholin-4-yl)phenyl]-1,3-oxazolidin-5-yl}methyl)thiophene-2-carboxamide (BAY 59-7939): an oral, direct factor Xa inhibitor. J Med Chem48:5900-8 (2005) 
 
Coagulation factor X
Name:Coagulation factor X
Type:Enzyme
Mol. Mass.:54726.60
Organism:Homo sapiens (Human)
Description:n/a
Residue:488
BDBM13008
BDBM12989
NameBDBM13008
Synonyms:4-Amino-5-chloro-N-({(5S)-2-oxo-3-[4-(3-oxomorpholin-4-yl)phenyl]-1,3-oxazolidin-5-yl}methyl)thiophene-2-carboxamide BAY 59-7939 Analog 23
TypeSmall organic molecule
Emp. Form.C19H19ClN4O5S
Mol. Mass.450.896
SMILESNc1cc(sc1Cl)C(=O)NC[C@H]1CN(C(=O)O1)c1ccc(cc1)N1CCOCC1=O