Reaction Details
TargetCoagulation factor XI
LigandBDBM335406
Substrate/Competitorn/a
Meas. Tech.Enzyme Activity Assay
IC50 11.0±n/a nM
Citation Courtney, SYarnold, CFlanagan, SBrace, GBarker, JIchihara, OGadouleau, ERichardson, AKondo, TImagawa, ANakatani, SSuzuki, RKouyama, S Pyridinone and pyrimidinone derivatives as factor Xia US Patent US9732085 Publication Date 8/15/2017
 
Coagulation factor XI
Name:Coagulation factor XI
Type:Enzyme
Mol. Mass.:70130.58
Organism:Homo sapiens (Human)
Description:P03951
Residue:625
BDBM335406
NameBDBM335406
Synonyms:US10717738, Example 270 methyl[4-(2-{(3R)-7-[5-chloro-2-(1H-tetrazol-1-yl)phenyl]-5-oxo-2,3-dihydro-5H-[1,3]thiazolo[3,2-a]pyridin-3-yl}-1H-imidazol-5-yl)phenyl]carbamate
TypeSmall organic molecule
Emp. Form.C25H19ClN8O3S
Mol. Mass.546.988
SMILESCOC(=O)Nc1ccc(cc1)-c1cnc([nH]1)[C@@H]1CSc2cc(cc(=O)n12)-c1cc(Cl)ccc1-n1cnnn1