Reaction Details
TargetCoagulation factor XI
LigandBDBM335410
Substrate/Competitorn/a
Meas. Tech.Enzyme Activity Assay
IC50 4.90±n/a nM
Citation Courtney, SYarnold, CFlanagan, SBrace, GBarker, JIchihara, OGadouleau, ERichardson, AKondo, TImagawa, ANakatani, SSuzuki, RKouyama, S Pyridinone and pyrimidinone derivatives as factor Xia US Patent US9732085 Publication Date 8/15/2017
 
Coagulation factor XI
Name:Coagulation factor XI
Type:Enzyme
Mol. Mass.:70130.58
Organism:Homo sapiens (Human)
Description:P03951
Residue:625
BDBM335410
NameBDBM335410
Synonyms:US10717738, Example 310 methyl[4-(2-{(3S)-7-[5-chloro-2-(4-chloro-1H-1,2,3-triazol-1-yl)phenyl]-5-oxo-1,2,3,5-tetrahydro-3-indolizinyl}-1H-imidazol-5-yl)phenyl]carbamate
TypeSmall organic molecule
Emp. Form.C27H21Cl2N7O3
Mol. Mass.562.407
SMILESCOC(=O)Nc1ccc(cc1)-c1cnc([nH]1)[C@@H]1CCc2cc(cc(=O)n12)-c1cc(Cl)ccc1-n1cc(Cl)nn1