Reaction Details
TargetCoagulation factor XI
LigandBDBM335412
Substrate/Competitorn/a
Meas. Tech.Enzyme Activity Assay
IC50 1.40±n/a nM
Citation Courtney, SYarnold, CFlanagan, SBrace, GBarker, JIchihara, OGadouleau, ERichardson, AKondo, TImagawa, ANakatani, SSuzuki, RKouyama, S Pyridinone and pyrimidinone derivatives as factor Xia US Patent US9732085 Publication Date 8/15/2017
 
Coagulation factor XI
Name:Coagulation factor XI
Type:Enzyme
Mol. Mass.:70130.58
Organism:Homo sapiens (Human)
Description:P03951
Residue:625
BDBM335412
NameBDBM335412
Synonyms:4-(2-{(3S)-7-[5-chloro-2-(1H-tetrazol-1-yl)phenyl]-5-oxo-1,2,3,5-tetrahydro-3-indolizinyl}-1H-imidazol-5-yl)-2-thiophenecarboxylic acid hydrochloride US9732085, 363
TypeSmall organic molecule
Emp. Form.C23H16ClN7O3S
Mol. Mass.505.936
SMILESOC(=O)c1cc(cs1)-c1cnc([nH]1)[C@@H]1CCc2cc(cc(=O)n12)-c1cc(Cl)ccc1-n1cnnn1