Reaction Details
TargetCoagulation factor XI
LigandBDBM335413
Substrate/Competitorn/a
Meas. Tech.Enzyme Activity Assay
IC50 1.60±n/a nM
Citation Courtney, SYarnold, CFlanagan, SBrace, GBarker, JIchihara, OGadouleau, ERichardson, AKondo, TImagawa, ANakatani, SSuzuki, RKouyama, S Pyridinone and pyrimidinone derivatives as factor Xia US Patent US9732085 Publication Date 8/15/2017
 
Coagulation factor XI
Name:Coagulation factor XI
Type:Enzyme
Mol. Mass.:70130.58
Organism:Homo sapiens (Human)
Description:P03951
Residue:625
BDBM335413
NameBDBM335413
Synonyms:5-(2-{(3S)-8-chloro-7-[5-chloro-2-(1H-tetrazol-1-yl)phenyl]-5-oxo-1,2,3,5-tetrahydro-3-indolizinyl}-1H-imidazol-5-yl)-2-thiophenecarboxylic acid hydrochloride US9732085, 387
TypeSmall organic molecule
Emp. Form.C23H15Cl2N7O3S
Mol. Mass.540.381
SMILESOC(=O)c1ccc(s1)-c1cnc([nH]1)[C@@H]1CCc2c(Cl)c(cc(=O)n12)-c1cc(Cl)ccc1-n1cnnn1