Reaction Details
TargetCoagulation factor XI
LigandBDBM335419
Substrate/Competitorn/a
Meas. Tech.Enzyme Activity Assay
IC50 1.70±n/a nM
Citation Courtney, SYarnold, CFlanagan, SBrace, GBarker, JIchihara, OGadouleau, ERichardson, AKondo, TImagawa, ANakatani, SSuzuki, RKouyama, S Pyridinone and pyrimidinone derivatives as factor Xia US Patent US9732085 Publication Date 8/15/2017
 
Coagulation factor XI
Name:Coagulation factor XI
Type:Enzyme
Mol. Mass.:70130.58
Organism:Homo sapiens (Human)
Description:P03951
Residue:625
BDBM335419
NameBDBM335419
Synonyms:4-(5-{7-[5-chloro-2-(1H-tetrazol-1-yl)phenyl]-5-oxo-1,2,3,5-tetrahydro-3-indolizinyl}-4-fluoro-1H-imidazol-2-yl)-2-thiophenecarboxylic acid US9732085, 848
TypeSmall organic molecule
Emp. Form.C23H15ClFN7O3S
Mol. Mass.523.927
SMILESOC(=O)c1cc(cs1)-c1nc(F)c([nH]1)C1CCc2cc(cc(=O)n12)-c1cc(Cl)ccc1-n1cnnn1