Reaction Details
TargetCoagulation factor XI
LigandBDBM335393
Substrate/Competitorn/a
Meas. Tech.Enzyme Activity Assay
IC50 2.40±n/a nM
Citation Courtney, SYarnold, CFlanagan, SBrace, GBarker, JIchihara, OGadouleau, ERichardson, AKondo, TImagawa, ANakatani, SSuzuki, RKouyama, S Pyridinone and pyrimidinone derivatives as factor Xia US Patent US9732085 Publication Date 8/15/2017
 
Coagulation factor XI
Name:Coagulation factor XI
Type:Enzyme
Mol. Mass.:70130.58
Organism:Homo sapiens (Human)
Description:P03951
Residue:625
BDBM335393
NameBDBM335393
Synonyms:US10717738, Example 57 methyl{4-[5-chloro-2-({4-[5-chloro-2-(1H-tetrazol-1-yl)phenyl]-2-oxo-1(2H)-pyridinyl}methyl)-1H-imidazol-4-yl]phenyl}carbamate
TypeSmall organic molecule
Emp. Form.C24H18Cl2N8O3
Mol. Mass.537.358
SMILESCOC(=O)Nc1ccc(cc1)-c1[nH]c(Cn2ccc(cc2=O)-c2cc(Cl)ccc2-n2cnnn2)nc1Cl