Reaction Details
TargetCarbonic anhydrase 2
LigandBDBM13056
Substrate/CompetitorBDBM10856
Meas. Tech.CA Inhibition Assay
pH7.5±n/a
Temperature295.15±n/a K
Ki 3±n/a nM
Citation Winum, JYTemperini, CEl Cheikh, KInnocenti, AVullo, DCiattini, SMontero, JLScozzafava, ASupuran, CT Carbonic anhydrase inhibitors: clash with Ala65 as a means for designing inhibitors with low affinity for the ubiquitous isozyme II, exemplified by the crystal structure of the topiramate sulfamide analogue. J Med Chem49:7024-31 (2006) 
 
Carbonic anhydrase 2
Name:Carbonic anhydrase 2
Type:Enzyme
Mol. Mass.:29250.71
Organism:Homo sapiens (Human)
Description:P00918
Residue:260
BDBM13056
BDBM10856
NameBDBM13056
Synonyms:(4S)-4-(ethylamino)-2-(3-methoxypropyl)-1,1-dioxo-2H,3H,4H-1,7,2-thieno[3,2-e][1,2]thiazine-6-sulfonamide sulfonamide 6
TypeSmall organic molecule
Emp. Form.C12H21N3O5S3
Mol. Mass.383.507
SMILESCCN[C@@H]1CN(CCCOC)S(=O)(=O)c2sc(cc12)S(N)(=O)=O