Reaction Details
TargetBeta-secretase 2
LigandBDBM335434
Substrate/Competitorn/a
Meas. Tech.BACE-2 Assay
Ki 0.570±n/a nM
Citation Walsh, SPCumming, JNHe, STaoka, BMTruong, QTWu, W C2-carbocyclic iminothiazine dioxides as BACE inhibitors, compositions, and their use US Patent US9732088 Publication Date 8/15/2017
 
Beta-secretase 2
Name:Beta-secretase 2
Type:Protein
Mol. Mass.:56171.20
Organism:Homo sapiens (Human)
Description:Q9Y5Z0
Residue:518
BDBM335434
NameBDBM335434
Synonyms:(3R,6S)-5-amino-6- cyclopropyl-3-(5-fluoro-2-((3- methoxy-1,7-naphthyridin-8- yl)amino)pyridin-4-yl)-3,6- dimethyl-3,6-dihydro-2H-1,4- thiazine 1,1-dioxide | US9732088, Example 6
TypeSmall organic molecule
Emp. Form.C23H25FN6O3S
Mol. Mass.484.546
SMILESCOc1cnc2c(Nc3cc(c(F)cn3)[C@]3(C)CS(=O)(=O)[C@@](C)(C4CC4)C(N)=N3)nccc2c1