Reaction Details
TargetBeta-secretase 2
LigandBDBM335444
Substrate/Competitorn/a
Meas. Tech.BACE-2 Assay
Ki 1.30±n/a nM
Citation Walsh, SPCumming, JNHe, STaoka, BMTruong, QTWu, W C2-carbocyclic iminothiazine dioxides as BACE inhibitors, compositions, and their use US Patent US9732088 Publication Date 8/15/2017
 
Beta-secretase 2
Name:Beta-secretase 2
Type:Protein
Mol. Mass.:56171.20
Organism:Homo sapiens (Human)
Description:Q9Y5Z0
Residue:518
BDBM335444
NameBDBM335444
Synonyms:(3R,6S)-5-amino-6- cyclopropyl-3-(5-fluoro-2-((2- methoxypyrido[3,4-b]pyrazin- 5-yl)amino)pyridin-4-yl)-3,6- dimethyl-3,6-dihydro-2H-1,4- thiazine 1,1-dioxide | US9732088, Example 9
TypeSmall organic molecule
Emp. Form.C22H24FN7O3S
Mol. Mass.485.534
SMILESCOc1cnc2c(Nc3cc(c(F)cn3)[C@]3(C)CS(=O)(=O)[C@@](C)(C4CC4)C(N)=N3)nccc2n1