Reaction Details
TargetSerine protease 1
LigandBDBM13291
Substrate/CompetitorBDBM12500
Meas. Tech.Enzyme Assay and Determination of the Inhibition Constants.
pH7.5±n/a
Temperature295.15±n/a K
Ki>2900±n/a nM
Citation Choi-Sledeski, YMMcGarry, DGGreen, DMMason, HJBecker, MRDavis, RSEwing, WRDankulich, WPManetta, VEMorris, RLSpada, APCheney, DLBrown, KDColussi, DJChu, VHeran, CLMorgan, SRBentley, RGLeadley, RJMaignan, SGuilloteau, JPDunwiddie, CTPauls, HW Sulfonamidopyrrolidinone factor Xa inhibitors: potency and selectivity enhancements via P-1 and P-4 optimization. J Med Chem42:3572-87 (1999) 
 
Serine protease 1
Name:Serine protease 1
Type:Enzyme
Mol. Mass.:25790.52
Organism:Bos taurus (bovine)
Description:P00760
Residue:246
BDBM13291
BDBM12500
NameBDBM13291
Synonyms:3-{[(3S)-2-oxo-3-{[4-(pyridin-2-yl)benzene]sulfonamido}pyrrolidin-1-yl]methyl}benzene-1-carboximidamide Sulfonamidopyrrolidinone 3d
TypeSmall organic molecule
Emp. Form.C23H23N5O3S
Mol. Mass.449.525
SMILESNC(=N)c1cccc(CN2CC[C@H](NS(=O)(=O)c3ccc(cc3)-c3ccccn3)C2=O)c1