Reaction Details
TargetCoagulation factor X
LigandBDBM13292
Substrate/CompetitorBDBM12593
Meas. Tech.Enzyme Assay and Determination of the Inhibition Constants.
Ki 210±n/a nM
Citation Choi-Sledeski, YMMcGarry, DGGreen, DMMason, HJBecker, MRDavis, RSEwing, WRDankulich, WPManetta, VEMorris, RLSpada, APCheney, DLBrown, KDColussi, DJChu, VHeran, CLMorgan, SRBentley, RGLeadley, RJMaignan, SGuilloteau, JPDunwiddie, CTPauls, HW Sulfonamidopyrrolidinone factor Xa inhibitors: potency and selectivity enhancements via P-1 and P-4 optimization. J Med Chem42:3572-87 (1999) 
 
Coagulation factor X
Name:Coagulation factor X
Type:Enzyme
Mol. Mass.:54726.60
Organism:Homo sapiens (Human)
Description:n/a
Residue:488
BDBM13292
BDBM12593
NameBDBM13292
Synonyms:3-{[(3S)-2-oxo-3-{[4-(pyridin-3-yl)benzene]sulfonamido}pyrrolidin-1-yl]methyl}benzene-1-carboximidamide | Sulfonamidopyrrolidinone 3e
TypeSmall organic molecule
Emp. Form.C23H23N5O3S
Mol. Mass.449.525
SMILESNC(=N)c1cccc(CN2CC[C@H](NS(=O)(=O)c3ccc(cc3)-c3cccnc3)C2=O)c1