Reaction Details
TargetCoagulation factor X
LigandBDBM13301
Substrate/CompetitorBDBM12593
Meas. Tech.Enzyme Assay and Determination of the Inhibition Constants.
Ki 49±n/a nM
Citation Choi-Sledeski, YMMcGarry, DGGreen, DMMason, HJBecker, MRDavis, RSEwing, WRDankulich, WPManetta, VEMorris, RLSpada, APCheney, DLBrown, KDColussi, DJChu, VHeran, CLMorgan, SRBentley, RGLeadley, RJMaignan, SGuilloteau, JPDunwiddie, CTPauls, HW Sulfonamidopyrrolidinone factor Xa inhibitors: potency and selectivity enhancements via P-1 and P-4 optimization. J Med Chem42:3572-87 (1999) 
 
Coagulation factor X
Name:Coagulation factor X
Type:Enzyme
Mol. Mass.:54726.60
Organism:Homo sapiens (Human)
Description:n/a
Residue:488
BDBM13301
BDBM12593
NameBDBM13301
Synonyms:3-[3-(S)-(5-Isoxazol-3-ylthiophene-2-ylsulfonylamino)-2-oxopyrrolidin-1-ylmethyl]benzamidine Sulfonamidopyrrolidinone 3n
TypeSmall organic molecule
Emp. Form.C19H19N5O4S2
Mol. Mass.445.515
SMILESNC(=N)c1cccc(CN2CC[C@H](NS(=O)(=O)c3ccc(s3)-c3ccon3)C2=O)c1