Reaction Details
TargetCatenin beta-1 [138-686]
LigandBDBM213756
Substrate/Competitorn/a
Meas. Tech.Fluorescence Polarization (FP) Assay
Ki 70370±1820 nM
Citation Ji, HYu, BZhang, MGuo, W Substituted 1H-indazol-1-OL analogs as inhibitors of beta catenin/Tcf protein-protein interactions US Patent US9738628 Publication Date 8/22/2017
 
Catenin beta-1 [138-686]
Name:Catenin beta-1 [138-686]
Type:Protein
Mol. Mass.:60127.24
Organism:Homo sapiens (Human)
Description:aa 138-686
Residue:549
BDBM213756
NameBDBM213756
Synonyms:US9284299, 7 | US9738628, Compound 14
TypeSmall organic molecule
Emp. Form.C10H9N5O2S
Mol. Mass.263.276
SMILESOn1nnc2cc(CCc3noc(=S)[nH]3)ccc12