Reaction Details
TargetHistamine receptor H3
LigandBDBM200837
Substrate/Competitorn/a
Meas. Tech.Radioligand binding assay
Ki 4.21±0 nM
Citation Gao, ZHall, DStefany, D Substituted N-heteroaryl spirolactam bipyrrolidines, preparation and therapeutic use thereof US Patent US9533995 Publication Date 1/3/2017
 
Histamine receptor H3
Name:Histamine receptor H3
Synonyms:n/a
Type:Enzyme
Mol. Mass.:48611.84
Organism:Macaca mulatta (Rhesus macaque)
Description:Q865E1
Residue:445
BDBM200837
NameBDBM200837
TypeSmall organic molecule
Emp. Form.C21H31N5O2
Mol. Mass.385.5031
SMILESC[C@H]1CCCN1[C@H]1CCN(C1)c1ncc(cn1)N1CCC2(CCOCC2)C1=O