Reaction Details
TargetIntermediate conductance calcium-activated potassium channel protein 4
LigandBDBM200855
Substrate/Competitorn/a
Meas. Tech.KCa3.1 Assay
IC50 77±0 nM
Citation Burke, MJMcKibben, BTschantz, MA Fused thiazin-3-ones as KCA3.1 inhibitors US Patent US9533999 Publication Date 1/3/2017
 
Intermediate conductance calcium-activated potassium channel protein 4
Name:Intermediate conductance calcium-activated potassium channel protein 4
Type:PROTEIN
Mol. Mass.:47723.22
Organism:Homo sapiens (Human)
Description:ChEMBL_1361891
Residue:427
BDBM200855
NameBDBM200855
Synonyms:US9533999, i-12
TypeSmall organic molecule
Emp. Form.C15H10ClF3N2O4S
Mol. Mass.406.764
SMILESFC(F)(F)Oc1cc(CN2C(=O)CS(=O)(=O)c3cccnc23)ccc1Cl