Reaction Details
TargetIntermediate conductance calcium-activated potassium channel protein 4
LigandBDBM200946
Substrate/Competitorn/a
Meas. Tech.KCa3.1 Assay
IC50 47±0 nM
Citation Burke, MJMcKibben, BTschantz, MA Fused thiazin-3-ones as KCA3.1 inhibitors US Patent US9533999 Publication Date 1/3/2017
 
Intermediate conductance calcium-activated potassium channel protein 4
Name:Intermediate conductance calcium-activated potassium channel protein 4
Type:PROTEIN
Mol. Mass.:47723.22
Organism:Homo sapiens (Human)
Description:ChEMBL_1361891
Residue:427
BDBM200946
NameBDBM200946
Synonyms:US9533999, ii-8
TypeSmall organic molecule
Emp. Form.C15H10ClF3N2O3S2
Mol. Mass.422.83
SMILESFC(F)(F)S(=O)(=O)c1cc(CN2C(=O)CSc3cccnc23)ccc1Cl