Reaction Details
TargetBeta-secretase 1
LigandBDBM312928
Substrate/Competitorn/a
Meas. Tech.Cell-Free Assay
IC50 31.0±n/a nM
Citation Brodney, MABeck, EMButler, CRZhang, LO Neill, BTBarreiro, GLaChapelle, EARogers, BN 2-amino 6-methyl-4,4a,5,6-tetrahydropyrano[3,4-d][1,3]thiazin-8a(8H)-yl-1,3-thiazol-4-yl amides US Patent US9744173 Publication Date 8/29/2017
 
Beta-secretase 1
Name:Beta-secretase 1
Type:Protein
Mol. Mass.:55755.10
Organism:Homo sapiens (Human)
Description:P56817
Residue:501
BDBM312928
NameBDBM312928
Synonyms:N-{2-[(4aR,6S,8aR)-2-Amino-6-methyl-4,4a,5,6-tetrahydropyrano[3,4-d][1,3]thiazin-8a(8H)-yl]-1,3-thiazol-4-yl}-5-(difluoromethoxy)pyridine-2-carboxamide US9744173, Example 1
TypeSmall organic molecule
Emp. Form.C25H23F2N5O4S2
Mol. Mass.559.608
SMILESC[C@H]1C[C@H]2CSC(NC(=O)c3ccccc3)=N[C@]2(CO1)c1nc(NC(=O)c2ccc(OC(F)F)cn2)cs1