Reaction Details
TargetBeta-secretase 1
LigandBDBM336311
Substrate/Competitorn/a
Meas. Tech.Cell-Free Assay
IC50 11.0±n/a nM
Citation Brodney, MABeck, EMButler, CRZhang, LO Neill, BTBarreiro, GLaChapelle, EARogers, BN 2-amino 6-methyl-4,4a,5,6-tetrahydropyrano[3,4-d][1,3]thiazin-8a(8H)-yl-1,3-thiazol-4-yl amides US Patent US9744173 Publication Date 8/29/2017
 
Beta-secretase 1
Name:Beta-secretase 1
Type:Protein
Mol. Mass.:55755.10
Organism:Homo sapiens (Human)
Description:P56817
Residue:501
BDBM336311
NameBDBM336311
Synonyms:N-{2-[(4aR,6S,8aR)-2-Amino-6-methyl-4,4a,5,6-tetrahydropyrano[3,4-d][1,3]thiazin-8a(8H)-yl]-1,3-thiazol-4-yl}-2-(difluoromethyl)-1,3-oxazole-4-carboxamide | US9744173, Example 8
TypeSmall organic molecule
Emp. Form.C18H20N4O2S2
Mol. Mass.388.507
SMILESC[C@H]1C[C@H]2CSC(NC(=O)c3ccccc3)=N[C@]2(CO1)c1nc(N)cs1