Reaction Details
TargetSodium channel protein type 9 subunit alpha
LigandBDBM336803
Substrate/Competitorn/a
Meas. Tech.FLIPR Assay
IC50 65.0±10 nM
Citation Ni, CPark, JHShao, BZhou, X Pyrimidines and use thereof US Patent US9745287 Publication Date 8/29/2017
 
Sodium channel protein type 9 subunit alpha
Name:Sodium channel protein type 9 subunit alpha
Type:Protein
Mol. Mass.:226375.97
Organism:Homo sapiens (Human)
Description:Q15858
Residue:1988
BDBM336803
NameBDBM336803
Synonyms:(S)-2-(4-(4-chloro-2-fluoro- phenoxy)phenyl)-6-(((2- oxopyrrolidin)-3-yl)amino)-methyl)pyrimidine- 4-carboxamide | US9745287, Compound 15
TypeSmall organic molecule
Emp. Form.C22H19ClFN5O3
Mol. Mass.455.869
SMILESNC(=O)c1cc(CNC2CCNC2=O)nc(n1)-c1ccc(Oc2ccc(Cl)cc2F)cc1