Reaction Details
TargetD(1A) dopamine receptor
LigandBDBM337363
Substrate/Competitorn/a
Meas. Tech.Binding Assay
Ki 76.8±n/a nM
Citation Gray, DLZhang, LBrodney, MADavoren, JEEfremov, IVGreen, MEO Neil, SVRogers, BN Heterocyclic compounds and their use as dopamine D1 ligands US Patent US9745317 Publication Date 8/29/2017
 
D(1A) dopamine receptor
Name:D(1A) dopamine receptor
Type:Enzyme
Mol. Mass.:49303.43
Organism:Homo sapiens (Human)
Description:P21728
Residue:446
BDBM337363
NameBDBM337363
Synonyms:4-[4-(4,6-Dimethylpyrimidin-5-yl)-3-methylphenoxy]-2,3-dihydrofuro[3,2-c]pyridine (1) | US9745317, 1
TypeSmall organic molecule
Emp. Form.C20H19N3O2
Mol. Mass.333.3838
SMILESCc1cc(Oc2nccc3OCCc23)ccc1-c1c(C)ncnc1C