Reaction Details
TargetD(1A) dopamine receptor
LigandBDBM337370
Substrate/Competitorn/a
Meas. Tech.Binding Assay
Ki 8.40±n/a nM
Citation Gray, DLZhang, LBrodney, MADavoren, JEEfremov, IVGreen, MEO Neil, SVRogers, BN Heterocyclic compounds and their use as dopamine D1 ligands US Patent US9745317 Publication Date 8/29/2017
 
D(1A) dopamine receptor
Name:D(1A) dopamine receptor
Type:Enzyme
Mol. Mass.:49303.43
Organism:Homo sapiens (Human)
Description:P21728
Residue:446
BDBM337370
NameBDBM337370
Synonyms:5-[4-(2,3-dihydro-1H-pyrrolo[3,2-c]pyridin-4-yloxy)-2- methylphenyl]-4,6-dimethylpyridazin-3(2H)-one US9745317, 8 | US9745317, 9
TypeSmall organic molecule
Emp. Form.C20H20N4O2
Mol. Mass.348.3984
SMILESCc1cc(Oc2nccc3NCCc23)ccc1-c1c(C)n[nH]c(=O)c1C