Reaction Details
TargetD(1A) dopamine receptor
LigandBDBM337382
Substrate/Competitorn/a
Meas. Tech.Binding Assay
Ki 446±n/a nM
Citation Gray, DLZhang, LBrodney, MADavoren, JEEfremov, IVGreen, MEO Neil, SVRogers, BN Heterocyclic compounds and their use as dopamine D1 ligands US Patent US9745317 Publication Date 8/29/2017
 
D(1A) dopamine receptor
Name:D(1A) dopamine receptor
Type:Enzyme
Mol. Mass.:49303.43
Organism:Homo sapiens (Human)
Description:P21728
Residue:446
BDBM337382
NameBDBM337382
Synonyms:US9745317, 20
TypeSmall organic molecule
Emp. Form.C20H20N4O
Mol. Mass.332.399
SMILESCc1cc(Oc2ncnc3CCCc23)ccc1-c1c(C)ncnc1C