Reaction Details
TargetCoagulation factor X
LigandBDBM13821
Substrate/CompetitorBDBM12500
Meas. Tech.Factor Xa Inhibition Assay
pH7.8±n/a
Temperature298.15±n/a K
Ki 50±n/a nM
Citation Matter, HDefossa, EHeinelt, UBlohm, PMSchneider, DMuller, AHerok, SSchreuder, HLiesum, ABrachvogel, VLonze, PWalser, AAl-Obeidi, FWildgoose, P Design and quantitative structure-activity relationship of 3-amidinobenzyl-1H-indole-2-carboxamides as potent, nonchiral, and selective inhibitors of blood coagulation factor Xa. J Med Chem45:2749-69 (2002) 
 
Coagulation factor X
Name:Coagulation factor X
Type:Enzyme
Mol. Mass.:54726.60
Organism:Homo sapiens (Human)
Description:n/a
Residue:488
BDBM13821
BDBM12500
NameBDBM13821
Synonyms:3-amidinobenzylindole carboxamide 5 | 3-bromo-N,1-bis[(3-carbamimidoylphenyl)methyl]-4-methyl-1H-indole-2-carboxamide
TypeSmall organic molecule
Emp. Form.C26H25BrN6O
Mol. Mass.517.42
SMILESCc1cccc2n(Cc3cccc(c3)C(N)=N)c(C(=O)NCc3cccc(c3)C(N)=N)c(Br)c12