Reaction Details
TargetCoagulation factor X
LigandBDBM13825
Substrate/CompetitorBDBM12500
Meas. Tech.Factor Xa Inhibition Assay
pH7.8±n/a
Temperature298.15±n/a K
Ki 9±n/a nM
Citation Matter, HDefossa, EHeinelt, UBlohm, PMSchneider, DMuller, AHerok, SSchreuder, HLiesum, ABrachvogel, VLonze, PWalser, AAl-Obeidi, FWildgoose, P Design and quantitative structure-activity relationship of 3-amidinobenzyl-1H-indole-2-carboxamides as potent, nonchiral, and selective inhibitors of blood coagulation factor Xa. J Med Chem45:2749-69 (2002) 
 
Coagulation factor X
Name:Coagulation factor X
Type:Enzyme
Mol. Mass.:54726.60
Organism:Homo sapiens (Human)
Description:n/a
Residue:488
BDBM13825
BDBM12500
NameBDBM13825
Synonyms:3-amidinobenzylindole carboxamide 9 | N,1-bis[(3-carbamimidoylphenyl)methyl]-3-chloro-1H-indole-2-carboxamide
TypeSmall organic molecule
Emp. Form.C25H23ClN6O
Mol. Mass.458.943
SMILESNC(=N)c1cccc(CNC(=O)c2c(Cl)c3ccccc3n2Cc2cccc(c2)C(N)=N)c1