Reaction Details
TargetCoagulation factor X
LigandBDBM13831
Substrate/CompetitorBDBM12500
Meas. Tech.Factor Xa Inhibition Assay
Ki 150±n/a nM
Citation Matter, HDefossa, EHeinelt, UBlohm, PMSchneider, DMuller, AHerok, SSchreuder, HLiesum, ABrachvogel, VLonze, PWalser, AAl-Obeidi, FWildgoose, P Design and quantitative structure-activity relationship of 3-amidinobenzyl-1H-indole-2-carboxamides as potent, nonchiral, and selective inhibitors of blood coagulation factor Xa. J Med Chem45:2749-69 (2002) 
 
Coagulation factor X
Name:Coagulation factor X
Type:Enzyme
Mol. Mass.:54726.60
Organism:Homo sapiens (Human)
Description:n/a
Residue:488
BDBM13831
BDBM12500
NameBDBM13831
Synonyms:2,2,2-trifluoroacetate; 4-[({1-[(3-carbamimidoylphenyl)methyl]-1H-indol-2-yl}formamido)methyl]-1-methylpyridin-1-ium | 3-amidinobenzylindole carboxamide 15
TypeSmall organic molecule
Emp. Form.C24H24N5O
Mol. Mass.398.4797
SMILESC[n+]1ccc(CNC(=O)c2cc3ccccc3n2Cc2cccc(c2)C(N)=N)cc1