Reaction Details
TargetCoagulation factor X
LigandBDBM13833
Substrate/CompetitorBDBM12500
Meas. Tech.Factor Xa Inhibition Assay
Ki 110±n/a nM
Citation Matter, HDefossa, EHeinelt, UBlohm, PMSchneider, DMuller, AHerok, SSchreuder, HLiesum, ABrachvogel, VLonze, PWalser, AAl-Obeidi, FWildgoose, P Design and quantitative structure-activity relationship of 3-amidinobenzyl-1H-indole-2-carboxamides as potent, nonchiral, and selective inhibitors of blood coagulation factor Xa. J Med Chem45:2749-69 (2002) 
 
Coagulation factor X
Name:Coagulation factor X
Type:Enzyme
Mol. Mass.:54726.60
Organism:Homo sapiens (Human)
Description:n/a
Residue:488
BDBM13833
BDBM12500
NameBDBM13833
Synonyms:2,2,2-trifluoroacetate; 4-{4-[({1-[(3-carbamimidoylphenyl)methyl]-4-methoxy-1H-indol-2-yl}formamido)methyl]phenyl}-1-methylpyridin-1-ium | 3-amidinobenzylindole carboxamide 17
TypeSmall organic molecule
Emp. Form.C31H30N5O2
Mol. Mass.504.6017
SMILESCOc1cccc2n(Cc3cccc(c3)C(N)=N)c(cc12)C(=O)NCc1ccc(cc1)-c1cc[n+](C)cc1