Reaction Details
TargetCoagulation factor X
LigandBDBM13834
Substrate/CompetitorBDBM12500
Meas. Tech.Factor Xa Inhibition Assay
Ki 92±n/a nM
Citation Matter, HDefossa, EHeinelt, UBlohm, PMSchneider, DMuller, AHerok, SSchreuder, HLiesum, ABrachvogel, VLonze, PWalser, AAl-Obeidi, FWildgoose, P Design and quantitative structure-activity relationship of 3-amidinobenzyl-1H-indole-2-carboxamides as potent, nonchiral, and selective inhibitors of blood coagulation factor Xa. J Med Chem45:2749-69 (2002) 
 
Coagulation factor X
Name:Coagulation factor X
Type:Enzyme
Mol. Mass.:54726.60
Organism:Homo sapiens (Human)
Description:n/a
Residue:488
BDBM13834
BDBM12500
NameBDBM13834
Synonyms:2,2,2-trifluoroacetate; 4-[(1S)-1-({1-[(3-carbamimidoylphenyl)methyl]-1H-indol-2-yl}formamido)ethyl]-1-methylpyridin-1-ium | 3-amidinobenzylindole carboxamide 18
TypeSmall organic molecule
Emp. Form.C25H26N5O
Mol. Mass.412.5063
SMILESC[C@H](NC(=O)c1cc2ccccc2n1Cc1cccc(c1)C(N)=N)c1cc[n+](C)cc1