Reaction Details
TargetCoagulation factor X
LigandBDBM13840
Substrate/CompetitorBDBM12500
Meas. Tech.Factor Xa Inhibition Assay
Ki 68±n/a nM
Citation Matter, HDefossa, EHeinelt, UBlohm, PMSchneider, DMuller, AHerok, SSchreuder, HLiesum, ABrachvogel, VLonze, PWalser, AAl-Obeidi, FWildgoose, P Design and quantitative structure-activity relationship of 3-amidinobenzyl-1H-indole-2-carboxamides as potent, nonchiral, and selective inhibitors of blood coagulation factor Xa. J Med Chem45:2749-69 (2002) 
 
Coagulation factor X
Name:Coagulation factor X
Type:Enzyme
Mol. Mass.:54726.60
Organism:Homo sapiens (Human)
Description:n/a
Residue:488
BDBM13840
BDBM12500
NameBDBM13840
Synonyms:1-[(3-carbamimidoylphenyl)methyl]-4-hydroxy-N-(naphthalen-1-ylmethyl)-1H-indole-2-carboxamide | 3-amidinobenzylindole carboxamide 24
TypeSmall organic molecule
Emp. Form.C28H24N4O2
Mol. Mass.448.5158
SMILESNC(=N)c1cccc(Cn2c(cc3c(O)cccc23)C(=O)NCc2cccc3ccccc23)c1