Reaction Details
TargetCoagulation factor X
LigandBDBM13872
Substrate/CompetitorBDBM12500
Meas. Tech.Factor Xa Inhibition Assay
Ki 240±n/a nM
Citation Matter, HDefossa, EHeinelt, UBlohm, PMSchneider, DMuller, AHerok, SSchreuder, HLiesum, ABrachvogel, VLonze, PWalser, AAl-Obeidi, FWildgoose, P Design and quantitative structure-activity relationship of 3-amidinobenzyl-1H-indole-2-carboxamides as potent, nonchiral, and selective inhibitors of blood coagulation factor Xa. J Med Chem45:2749-69 (2002) 
 
Coagulation factor X
Name:Coagulation factor X
Type:Enzyme
Mol. Mass.:54726.60
Organism:Homo sapiens (Human)
Description:n/a
Residue:488
BDBM13872
BDBM12500
NameBDBM13872
Synonyms:1-[(3-carbamimidoylphenyl)methyl]-N-[(3-carbamoylphenyl)methyl]-1H-indole-2-carboxamide | 3-amidinobenzylindole carboxamide 57
TypeSmall organic molecule
Emp. Form.C25H23N5O2
Mol. Mass.425.4824
SMILESNC(=N)c1cccc(Cn2c(cc3ccccc23)C(=O)NCc2cccc(c2)C(N)=O)c1