Reaction Details
TargetCoagulation factor X
LigandBDBM13881
Substrate/CompetitorBDBM12500
Meas. Tech.Factor Xa Inhibition Assay
Ki 131±n/a nM
Citation Matter, HDefossa, EHeinelt, UBlohm, PMSchneider, DMuller, AHerok, SSchreuder, HLiesum, ABrachvogel, VLonze, PWalser, AAl-Obeidi, FWildgoose, P Design and quantitative structure-activity relationship of 3-amidinobenzyl-1H-indole-2-carboxamides as potent, nonchiral, and selective inhibitors of blood coagulation factor Xa. J Med Chem45:2749-69 (2002) 
 
Coagulation factor X
Name:Coagulation factor X
Type:Enzyme
Mol. Mass.:54726.60
Organism:Homo sapiens (Human)
Description:n/a
Residue:488
BDBM13881
BDBM12500
NameBDBM13881
Synonyms:1-[(3-carbamimidoylphenyl)methyl]-4-hydroxy-N-[(3-methylphenyl)methyl]-1H-indole-2-carboxamide CHEMBL76987
TypeSmall organic molecule
Emp. Form.C25H24N4O2
Mol. Mass.412.4837
SMILESCc1cccc(CNC(=O)c2cc3c(O)cccc3n2Cc2cccc(c2)C(N)=N)c1