Reaction Details
TargetProthrombin
LigandBDBM13896
Substrate/CompetitorBDBM13573
Meas. Tech.Thrombin Inhibition Assay
Ki 15800±n/a nM
Citation Matter, HDefossa, EHeinelt, UBlohm, PMSchneider, DMuller, AHerok, SSchreuder, HLiesum, ABrachvogel, VLonze, PWalser, AAl-Obeidi, FWildgoose, P Design and quantitative structure-activity relationship of 3-amidinobenzyl-1H-indole-2-carboxamides as potent, nonchiral, and selective inhibitors of blood coagulation factor Xa. J Med Chem45:2749-69 (2002) 
 
Prothrombin
Name:Prothrombin
Type:Protein
Mol. Mass.:70029.57
Organism:Homo sapiens (Human)
Description:P00734
Residue:622
BDBM13896
BDBM13573
NameBDBM13896
Synonyms:2,2,2-trifluoroacetate; 4-[({1-[(3-carbamimidoylphenyl)methyl]-5-chloro-1H-indol-2-yl}formamido)methyl]-N,N,N-trimethylanilinium | 3-amidinobenzylindole carboxamide 81
TypeSmall organic molecule
Emp. Form.C27H29ClN5O
Mol. Mass.475.005
SMILESC[N+](C)(C)c1ccc(CNC(=O)c2cc3cc(Cl)ccc3n2Cc2cccc(c2)C(N)=N)cc1